Target
Serine hydroxymethyltransferase, cytosolic
Ligand
BDBM285676
Substrate
Meas. Tech.
Enzymatic Assay
IC50
4580±n/a nM
Citation
 Rabinowitz, JDKim, HDucker, GSGhergurovich, JM SHMT inhibitors US Patent  US10934305 Publication Date 3/2/2021 
Target
Name:
Serine hydroxymethyltransferase, cytosolic
Synonyms:
GLYC_HUMAN SHMT Serine methylase
Type:
PROTEIN
Mol. Mass.:
53091.10
Organism:
Homo sapiens (Human)
Description:
ChEMBL_745716
Residue:
483
  
Inhibitor
Name:
BDBM285676
Synonyms:
US10077273, Compound HK-6 | US10934305, Compound HK-6
Type:
Small organic molecule
Emp. Form.:
C18H20N4O2
Mol. Mass.:
324.377
SMILES:
COc1cccc(c1)C1(C(C)C)c2c(C)n[nH]c2OC(N)=C1C#N
: