Target
Isocitrate dehydrogenase [NADP] cytoplasmic [R132H]
Ligand
BDBM279854
Substrate
Meas. Tech.
In Vitro Assays for IDH1m (R132H or R132C) Inhibitors
IC50
>1000±n/a nM
Citation
 Konteatis, ZDPopovici-Muller, JTravins, JZahler, RCai, ZZhou, D Therapeutically active compounds and their methods of use US Patent  US10946023 Publication Date 3/16/2021 
Target
Name:
Isocitrate dehydrogenase [NADP] cytoplasmic [R132H]
Synonyms:
Cytosolic NADP-isocitrate dehydrogenase (IDH1)(R132H) IDH1 R132H IDHC_HUMAN Isocitrate dehydrogenase 1 mutant (R132H) Isocitrate dehydrogenase [NADP] cytoplasmic (IDH1)(R132H) PICD
Type:
Protein
Mol. Mass.:
46641.74
Organism:
Homo sapiens (Human)
Description:
Human IDH1 R132H (SEQ ID No. 2 in patent). First three are removed. Google patent parsed wrong.
Residue:
414
  
Inhibitor
Name:
BDBM279854
Synonyms:
US10028961, Compound 1 US10946023, Compound 1
Type:
Small organic molecule
Emp. Form.:
C17H19F3N6
Mol. Mass.:
364.3682
SMILES:
FC(F)(F)c1cccc(n1)-c1nc(NCC2CC2)nc(NCC2CC2)n1
: