Target
Tyrosine-protein kinase Mer/receptor UFO
Ligand
BDBM298984
Substrate
Meas. Tech.
Biochemical Assay
IC50
<10±n/a nM
Citation
 Kim, MKim, SKim, JKKim, HRyu, KMPark, SJPark, TSheen, JYoon, TJang, MY Heteroaryl compounds and their use as therapeutic drugs US Patent  US10947215 Publication Date 3/16/2021 
Target
Name:
Tyrosine-protein kinase Mer/receptor UFO
Synonyms:
recombinant proteins of human c-MER and AXL catalytic domains
Type:
Protein
Mol. Mass.:
Description:
Components:
This complex has 2 components.
Component 1
Name:
Tyrosine-protein kinase receptor UFO
Synonyms:
AXL TEL/AXL UFO | UFO_HUMAN
Type:
Enzyme
Mol. Mass.:
98316.97
Organism:
Homo sapiens (Human)
Description:
P30530
Residue:
894
  
Component 2
Name:
Tyrosine-protein kinase Mer
Synonyms:
MER MERTK Proto-oncogene c-Mer Receptor tyrosine kinase MerTK | Tyrosine-protein kinase Mer
Type:
PROTEIN
Mol. Mass.:
110234.77
Organism:
Homo sapiens (Human)
Description:
ChEMBL_1498723
Residue:
999
  
Inhibitor
Name:
BDBM298984
Synonyms:
US10125118, Example 390 | US10947215, Example 390
Type:
Small organic molecule
Emp. Form.:
C32H42N6O2
Mol. Mass.:
542.7149
SMILES:
CCc1cc(CO[C@H]2CNC[C@@H]2NC(=O)c2cc(cnc2N)-c2ccc(CN3CCN(C)CC3)cc2)ccc1C
: