Target
Serine/threonine-protein kinase receptor R3 [166-493]
Ligand
BDBM451769
Substrate
Meas. Tech.
Caliper Assay
IC50
75.0±n/a nM
Citation
 Arista, LBabu, SBian, JCui, KDillon, MPLattmann, RLi, JLiao, LLizos, DRamos, RStiefl, NJUllrich, TUsselmann, PWang, XWaykole, LMWeiler, SZhang, YZhou, YZhu, T Aminopyridine derivatives and their use as selective ALK-2 inhibitors US Patent  US10947218 Publication Date 3/16/2021 
Target
Name:
Serine/threonine-protein kinase receptor R3 [166-493]
Synonyms:
ACVL1_HUMAN ACVRLK1 Activin receptor-like kinase 1 (ALK1)(aa 166-493)
Type:
Enzyme Catalytic Domain
Mol. Mass.:
36974.75
Organism:
Homo sapiens (Human)
Description:
aa 166-493
Residue:
328
  
Inhibitor
Name:
BDBM451769
Synonyms:
US10710980, Example 1 | US10947218, Example 1
Type:
Small organic molecule
Emp. Form.:
C29H39N5O4S
Mol. Mass.:
553.716
SMILES:
CS(=O)(=O)N1CCC(CC1)N1C[C@H]2C[C@]2(C1)c1ccc(cc1)-c1cnc(N)c(c1)C(=O)N[C@H]1CC[C@H](O)CC1
: