Target
Serine/threonine-protein kinase receptor R3 [166-493]
Ligand
BDBM451778
Substrate
Meas. Tech.
Caliper Assay
IC50
89.0±n/a nM
Citation
 Arista, LBabu, SBian, JCui, KDillon, MPLattmann, RLi, JLiao, LLizos, DRamos, RStiefl, NJUllrich, TUsselmann, PWang, XWaykole, LMWeiler, SZhang, YZhou, YZhu, T Aminopyridine derivatives and their use as selective ALK-2 inhibitors US Patent  US10947218 Publication Date 3/16/2021 
Target
Name:
Serine/threonine-protein kinase receptor R3 [166-493]
Synonyms:
ACVL1_HUMAN ACVRLK1 Activin receptor-like kinase 1 (ALK1)(aa 166-493)
Type:
Enzyme Catalytic Domain
Mol. Mass.:
36974.75
Organism:
Homo sapiens (Human)
Description:
aa 166-493
Residue:
328
  
Inhibitor
Name:
BDBM451778
Synonyms:
US10710980, Example 10 | US10947218, Example 10
Type:
Small organic molecule
Emp. Form.:
C29H39N5O3
Mol. Mass.:
505.6517
SMILES:
Nc1ncc(cc1C(=O)N[C@H]1CC[C@H](O)CC1)-c1ccc(cc1)[C@@]12C[C@@H]1CN(CCN1CCOCC1)C2
: