Target
Protein M2-1
Ligand
BDBM301482
Substrate
Meas. Tech.
Antiviral Activity
EC50
13.5±n/a nM
Citation
 Tahari, AVendeville, SMJonckers, THRaboisson, PJDemin, SDHu, L Piperidine substituted tricyclic pyrazolo[1,5-a]pyrimidine derivatives with inhibitory activity on the replication of the respiratory syncytial virus (RSV) US Patent  US10131673 Publication Date 11/20/2018 
Target
Name:
Protein M2-1
Synonyms:
Envelope-associated 22 kDa protein M21_HRSVA | Matrix M2-1
Type:
Enzyme Catalytic Domain
Mol. Mass.:
22163.59
Organism:
Human respiratory syncytial virus A (strain A2)
Description:
P04545
Residue:
194
  
Inhibitor
Name:
BDBM301482
Synonyms:
US10131673, Compound P9
Type:
Small organic molecule
Emp. Form.:
C29H36N8O3S
Mol. Mass.:
576.713
SMILES:
Cc1ccc2nc(NS(C)(=O)=O)nc(N3CCCCC3c3cc4nc5CCCCc5c(N5CCOCC5)n4n3)c2c1
: