Target
Fibroblast growth factor receptor 3
Ligand
BDBM278519
Substrate
Meas. Tech.
FGFR Enzymatic Assay
IC50
<100±n/a nM
Citation
 Sun, YYao, WWu, LXu, MQian, DZhang, F Bicyclic heterocycles as FGFR inhibitors US Patent  US10947230 Publication Date 3/16/2021 
Target
Name:
Fibroblast growth factor receptor 3
Synonyms:
CD_antigen: CD333 FGFR3 Fibroblast growth factor receptor JTK4
Type:
Protein
Mol. Mass.:
87699.57
Organism:
Homo sapiens (Human)
Description:
P22607
Residue:
806
  
Inhibitor
Name:
BDBM278519
Synonyms:
(S)-2'-(2,6-difluoro-3,5-dimethoxyphenyl)-6'-((tetrahydrofuran-2-yl)methylamino)-1'H-spiro[cyclopropane-1,4'-[2,7]naphthyridin]-3'(2'H)-one US10450313, Example 35 US11530214, Example 35
Type:
Small organic molecule
Emp. Form.:
C23H25F2N3O4
Mol. Mass.:
445.4591
SMILES:
COc1cc(OC)c(F)c(N2Cc3cnc(NC[C@@H]4CCCO4)cc3C3(CC3)C2=O)c1F
: