Target
Mitogen-activated protein kinase kinase kinase 12
Ligand
BDBM301555
Substrate
Meas. Tech.
DLK TR-FRET Inhibition Assay
Ki
30.8±n/a nM
Citation
 Estrada, APatel, SKellar, THuestis, MShore, DSiu, M Tricyclic DLK inhibitors and uses thereof US Patent  US10131675 Publication Date 11/20/2018 
Target
Name:
Mitogen-activated protein kinase kinase kinase 12
Synonyms:
DLK Leucine-zipper protein kinase MAP3K12 MUK Mixed lineage kinase | ZPK
Type:
PROTEIN
Mol. Mass.:
93216.56
Organism:
Homo sapiens (Human)
Description:
ChEMBL_1460553
Residue:
859
  
Inhibitor
Name:
BDBM301555
Synonyms:
US10131675, Example 41
Type:
Small organic molecule
Emp. Form.:
C22H22N8O2
Mol. Mass.:
430.4625
SMILES:
COC1CN(C1)c1nc(nc2n3CCOC(C)(C)c3nc12)-c1cnc2[nH]cc(C#N)c2c1
: