Target
Vasopressin V1b receptor
Ligand
BDBM301675
Substrate
Meas. Tech.
In Vitro V1b Receptor Assay
EC50
142280±n/a nM
Citation
 Wisniewski, KSchteingart, CRiviere, P Vasopressin-2 receptor agonists US Patent  US10131692 Publication Date 11/20/2018 
Target
Name:
Vasopressin V1b receptor
Synonyms:
AVPR V1b AVPR1B Antidiuretic hormone receptor 1b V1bR VPR3 Vasopressin V1b receptor (V1b) Vasopressin V3 receptor
Type:
Enzyme
Mol. Mass.:
46985.01
Organism:
Homo sapiens (Human)
Description:
P47901
Residue:
424
  
Inhibitor
Name:
BDBM301675
Synonyms:
US10131692, Compound 7
Type:
Small organic molecule
Emp. Form.:
C44H61ClFN11O8S
Mol. Mass.:
958.54
SMILES:
CC(C)[C@@H]1NC(=O)[C@H](Cc2ccc(F)cc2)NC(=O)[C@H](Cc2ccc(Cl)cc2)NC(=O)CCCSC[C@H](NC(=O)[C@H](CC(N)=O)NC1=O)C(=O)N1CCC[C@H]1C(=O)NCCCCNC(N)=N
: