Target
Vasopressin V2 receptor
Ligand
BDBM301683
Substrate
Meas. Tech.
In Vitro V2 Receptor Assay
EC50
450±n/a nM
Citation
 Wisniewski, KSchteingart, CRiviere, P Vasopressin-2 receptor agonists US Patent  US10131692 Publication Date 11/20/2018 
Target
Name:
Vasopressin V2 receptor
Synonyms:
ADHR AVPR2 DIR Renal-type arginine vasopressin receptor V2R_HUMAN Vasopressin V2 receptor | Vasopressin receptor
Type:
Receptor
Mol. Mass.:
40295.28
Organism:
Homo sapiens (Human)
Description:
P30518
Residue:
371
  
Inhibitor
Name:
BDBM301683
Synonyms:
US10131692, Compound 15
Type:
Small organic molecule
Emp. Form.:
C46H67ClN12O10S2
Mol. Mass.:
1047.682
SMILES:
CC(C)NC(=O)[C@@H](CCCNC(N)=N)NC(=O)[C@@H]1C[C@@H](O)CN1C(=O)[C@@H]1CSCCCC(=O)N[C@@H](Cc2ccc(Cl)cc2)C(=O)N[C@@H](Cc2cccs2)C(=O)N[C@@H](C(C)C)C(=O)N[C@@H](CC(N)=O)C(=O)N1
: