Target
Wee1-like protein kinase
Ligand
BDBM488518
Substrate
Meas. Tech.
In Vitro Enzymatic Inhibitory Activity Assay
IC50
48.8±n/a nM
Citation
 Qian, WYang, CLi, ZLi, JLi, JChen, S 1,2-dihydro-3H-pyrazolo[3,4-d]pyrimidin-3-one derivative as Wee1 inhibitor US Patent  US10954253 Publication Date 3/23/2021 
Target
Name:
Wee1-like protein kinase
Synonyms:
Serine/threonine-protein kinase WEE1 WEE1 homolog (S. pombe) | WEE1_HUMAN
Type:
PROTEIN
Mol. Mass.:
71599.12
Organism:
Homo sapiens (Human)
Description:
ChEMBL_1445054
Residue:
646
  
Inhibitor
Name:
BDBM488518
Synonyms:
US10954253, Compound 24
Type:
Small organic molecule
Emp. Form.:
C32H42N8O2
Mol. Mass.:
570.7283
SMILES:
CCCn1n(-c2cccc(n2)C(C)(C)O)c2nc(Nc3ccc(cc3)N3CCC4(CCN(C)CC4)CC3)ncc2c1=O
: