Target
Wee1-like protein kinase
Ligand
BDBM488537
Substrate
Meas. Tech.
In Vitro Enzymatic Inhibitory Activity Assay
IC50
12.6±n/a nM
Citation
 Qian, WYang, CLi, ZLi, JLi, JChen, S 1,2-dihydro-3H-pyrazolo[3,4-d]pyrimidin-3-one derivative as Wee1 inhibitor US Patent  US10954253 Publication Date 3/23/2021 
Target
Name:
Wee1-like protein kinase
Synonyms:
Serine/threonine-protein kinase WEE1 WEE1 homolog (S. pombe) | WEE1_HUMAN
Type:
PROTEIN
Mol. Mass.:
71599.12
Organism:
Homo sapiens (Human)
Description:
ChEMBL_1445054
Residue:
646
  
Inhibitor
Name:
BDBM488537
Synonyms:
US10954253, Compound 44
Type:
Small organic molecule
Emp. Form.:
C33H39N9O2
Mol. Mass.:
593.7219
SMILES:
CN1CCC2(CC1)CCN(CC2)c1ccc(Nc2ncc3c(n2)n(-c2cccc(n2)N2CCCC2=O)n(CC=C)c3=O)cc1
: