Target
Wee1-like protein kinase
Ligand
BDBM488543
Substrate
Meas. Tech.
In Vitro Enzymatic Inhibitory Activity Assay
IC50
2.50±n/a nM
Citation
 Qian, WYang, CLi, ZLi, JLi, JChen, S 1,2-dihydro-3H-pyrazolo[3,4-d]pyrimidin-3-one derivative as Wee1 inhibitor US Patent  US10954253 Publication Date 3/23/2021 
Target
Name:
Wee1-like protein kinase
Synonyms:
Serine/threonine-protein kinase WEE1 WEE1 homolog (S. pombe) | WEE1_HUMAN
Type:
PROTEIN
Mol. Mass.:
71599.12
Organism:
Homo sapiens (Human)
Description:
ChEMBL_1445054
Residue:
646
  
Inhibitor
Name:
BDBM488543
Synonyms:
US10954253, Compound 50
Type:
Small organic molecule
Emp. Form.:
C32H38N8O2
Mol. Mass.:
566.6965
SMILES:
CN1CCC2(CC1)CCN(CC2)c1ccc(Nc2ncc3c(n2)n(-c2cccc(OC4CC4)n2)n(CC=C)c3=O)cc1
: