Target
Proto-oncogene tyrosine-protein kinase ROS
Ligand
BDBM267436
Substrate
Meas. Tech.
HTRF Kinease-TK Assay
IC50
2.50±n/a nM
Citation
 Andrews, SWBlake, JFHaas, JKolakowski, GR Macrocyclic compounds as ROS1 kinase inhibitors US Patent  US10966985 Publication Date 4/6/2021 
Target
Name:
Proto-oncogene tyrosine-protein kinase ROS
Synonyms:
MCF3 Proto-oncogene c-Ros-1 ROS1 Receptor tyrosine kinase c-ros oncogene 1 c-Ros receptor tyrosine kinase
Type:
Enzyme
Mol. Mass.:
263897.39
Organism:
Homo sapiens (Human)
Description:
P08922
Residue:
2347
  
Inhibitor
Name:
BDBM267436
Synonyms:
US10688100, Compound 20 US9718822, 20 US9902741, Example 20
Type:
Small organic molecule
Emp. Form.:
C20H20FN5O2
Mol. Mass.:
381.4035
SMILES:
Fc1ccc2OCCCNC(=O)c3cnn4ccc(nc34)N3CCC[C@@H]3c2c1
: