Target
Macrophage migration inhibitory factor
Ligand
BDBM403756
Substrate
Meas. Tech.
Inhibition Assay
Ki
2300±n/a nM
Citation
 Jorgensen, WLDziedzic, PCisneros, J Biaryltriazole inhibitors of macrophage migration inhibitory factor US Patent  US10968198 Publication Date 4/6/2021 
Target
Name:
Macrophage migration inhibitory factor
Synonyms:
GIF Glycosylation-inhibiting factor L-dopachrome tautomerase MIF/CD74 (Macrophage migration inhibitory factor and HLA-DR antigens-associated invariant chain) MMIF Macrophage migration inhibitory factor (MIF) | Phenylpyruvate tautomerase
Type:
Enzyme
Mol. Mass.:
12478.18
Organism:
Homo sapiens (Human)
Description:
P14174
Residue:
115
  
Inhibitor
Name:
BDBM403756
Synonyms:
US10336721, Example 12 | US10968198, Example 12
Type:
Small organic molecule
Emp. Form.:
C18H14N4O
Mol. Mass.:
302.33
SMILES:
Cc1cc(nc2ccccc12)-c1cn(nn1)-c1ccc(O)cc1
: