Target
Sodium channel protein type 9 subunit alpha
Ligand
BDBM258125
Substrate
Meas. Tech.
Electrophysiological Assay
IC50
43.0±n/a nM
Citation
 Takahashi, SDomon, YKitano, YShinozuka, T Drugs for treating respiratory diseases US Patent  US9597330 Publication Date 3/21/2017 
Target
Name:
Sodium channel protein type 9 subunit alpha
Synonyms:
NENA Peripheral sodium channel 1 SCN9A_HUMAN Voltage-gated sodium channel subunit Nav1.7 hNE-Na
Type:
Protein
Mol. Mass.:
226375.97
Organism:
Homo sapiens (Human)
Description:
Q15858
Residue:
1988
  
Inhibitor
Name:
BDBM258125
Synonyms:
US9493448, 27 US9845313, Example 27
Type:
Small organic molecule
Emp. Form.:
C19H19F2N5O3S
Mol. Mass.:
435.448
SMILES:
Cn1nccc1[C@H]1CCC[C@@H]1Oc1cc(F)c(c(F)c1)S(=O)(=O)Nc1ccncn1
: