Target
Sodium channel protein type 9 subunit alpha
Ligand
BDBM301800
Substrate
Meas. Tech.
Electrophysiological Assay
IC50
91.0±n/a nM
Citation
 Takahashi, SDomon, YKitano, YShinozuka, T Drugs for treating respiratory diseases US Patent  US9597330 Publication Date 3/21/2017 
Target
Name:
Sodium channel protein type 9 subunit alpha
Synonyms:
NENA Peripheral sodium channel 1 SCN9A_HUMAN Voltage-gated sodium channel subunit Nav1.7 hNE-Na
Type:
Protein
Mol. Mass.:
226375.97
Organism:
Homo sapiens (Human)
Description:
Q15858
Residue:
1988
  
Inhibitor
Name:
BDBM301800
Synonyms:
2,5-Difluoro-4-{[(1S*,2R*)-2-(1-methyl-1H-pyrazol-5-yl)cycloheptyl]oxy}-N-(pyrimidin-4-yl)benzenesulfonamide | US9597330, Example 9
Type:
Small organic molecule
Emp. Form.:
C23H25F2N3O3S
Mol. Mass.:
461.525
SMILES:
CC1C=CC=C1[C@H]1CCCCC[C@@H]1Oc1cc(F)c(cc1F)S(=O)(=O)Nc1ccncn1
: