Target
Sodium channel protein type 9 subunit alpha
Ligand
BDBM258155
Substrate
Meas. Tech.
Electrophysiological Assay
IC50
75.0±n/a nM
Citation
 Takahashi, SDomon, YKitano, YShinozuka, T Drugs for treating respiratory diseases US Patent  US9597330 Publication Date 3/21/2017 
Target
Name:
Sodium channel protein type 9 subunit alpha
Synonyms:
NENA Peripheral sodium channel 1 SCN9A_HUMAN Voltage-gated sodium channel subunit Nav1.7 hNE-Na
Type:
Protein
Mol. Mass.:
226375.97
Organism:
Homo sapiens (Human)
Description:
Q15858
Residue:
1988
  
Inhibitor
Name:
BDBM258155
Synonyms:
US9493448, 57 US9845313, Example 57
Type:
Small organic molecule
Emp. Form.:
C22H27N5O3S
Mol. Mass.:
441.546
SMILES:
Cc1cc(ccc1O[C@H]1CCCCC[C@@H]1c1ccnn1C)S(=O)(=O)Nc1ccncn1
: