Target
Sodium channel protein type 9 subunit alpha
Ligand
BDBM258188
Substrate
Meas. Tech.
Electrophysiological Assay
IC50
65.0±n/a nM
Citation
 Takahashi, SDomon, YKitano, YShinozuka, T Drugs for treating respiratory diseases US Patent  US9597330 Publication Date 3/21/2017 
Target
Name:
Sodium channel protein type 9 subunit alpha
Synonyms:
NENA Peripheral sodium channel 1 SCN9A_HUMAN Voltage-gated sodium channel subunit Nav1.7 hNE-Na
Type:
Protein
Mol. Mass.:
226375.97
Organism:
Homo sapiens (Human)
Description:
Q15858
Residue:
1988
  
Inhibitor
Name:
BDBM258188
Synonyms:
US9493448, 93 US9845313, Example 93
Type:
Small organic molecule
Emp. Form.:
C21H23F2N5O3S
Mol. Mass.:
463.501
SMILES:
Cn1nccc1[C@H]1CC(C)(C)C[C@@H]1Oc1cc(F)c(cc1F)S(=O)(=O)Nc1ccncn1
: