Target
Sodium channel protein type 9 subunit alpha
Ligand
BDBM258146
Substrate
Meas. Tech.
Electrophysiological Assay
IC50
20.0±n/a nM
Citation
 Takahashi, SDomon, YKitano, YShinozuka, T Drugs for treating respiratory diseases US Patent  US9597330 Publication Date 3/21/2017 
Target
Name:
Sodium channel protein type 9 subunit alpha
Synonyms:
NENA Peripheral sodium channel 1 SCN9A_HUMAN Voltage-gated sodium channel subunit Nav1.7 hNE-Na
Type:
Protein
Mol. Mass.:
226375.97
Organism:
Homo sapiens (Human)
Description:
Q15858
Residue:
1988
  
Inhibitor
Name:
BDBM258146
Synonyms:
US9493448, 122 US9493448, 48 US9845313, Example 154
Type:
Small organic molecule
Emp. Form.:
C20H21ClFN5O3S
Mol. Mass.:
465.929
SMILES:
Cn1nccc1[C@H]1CCCC[C@@H]1Oc1cc(F)c(cc1Cl)S(=O)(=O)Nc1ccncn1
: