Target
Sodium channel protein type 9 subunit alpha
Ligand
BDBM258233
Substrate
Meas. Tech.
Electrophysiological Assay
IC50
34.0±n/a nM
Citation
 Takahashi, SDomon, YKitano, YShinozuka, T Drugs for treating respiratory diseases US Patent  US9597330 Publication Date 3/21/2017 
Target
Name:
Sodium channel protein type 9 subunit alpha
Synonyms:
NENA Peripheral sodium channel 1 SCN9A_HUMAN Voltage-gated sodium channel subunit Nav1.7 hNE-Na
Type:
Protein
Mol. Mass.:
226375.97
Organism:
Homo sapiens (Human)
Description:
Q15858
Residue:
1988
  
Inhibitor
Name:
BDBM258233
Synonyms:
US9493448, 140 US9597330, Example 51 | US9845313, Example 150
Type:
Small organic molecule
Emp. Form.:
C18H17ClFN5O3S
Mol. Mass.:
437.876
SMILES:
Fc1cc(O[C@H]2CCC[C@@H]2c2ccn[nH]2)c(Cl)cc1S(=O)(=O)Nc1ccncn1
: