Target
Sodium channel protein type 9 subunit alpha
Ligand
BDBM258247
Substrate
Meas. Tech.
Electrophysiological Assay
IC50
41.0±n/a nM
Citation
 Takahashi, SDomon, YKitano, YShinozuka, T Drugs for treating respiratory diseases US Patent  US9597330 Publication Date 3/21/2017 
Target
Name:
Sodium channel protein type 9 subunit alpha
Synonyms:
NENA Peripheral sodium channel 1 SCN9A_HUMAN Voltage-gated sodium channel subunit Nav1.7 hNE-Na
Type:
Protein
Mol. Mass.:
226375.97
Organism:
Homo sapiens (Human)
Description:
Q15858
Residue:
1988
  
Inhibitor
Name:
BDBM258247
Synonyms:
US9493448, 156 US9845313, Example 156
Type:
Small organic molecule
Emp. Form.:
C19H17ClF3N5O3S
Mol. Mass.:
487.883
SMILES:
Fc1cc(O[C@H]2CC(F)(F)CC[C@@H]2c2ccn[nH]2)c(Cl)cc1S(=O)(=O)Nc1ccncn1
: