Target
Sodium channel protein type 9 subunit alpha
Ligand
BDBM258176
Substrate
Meas. Tech.
Electrophysiological Assay
IC50
34.0±n/a nM
Citation
 Takahashi, SDomon, YKitano, YShinozuka, T Drugs for treating respiratory diseases US Patent  US9597330 Publication Date 3/21/2017 
Target
Name:
Sodium channel protein type 9 subunit alpha
Synonyms:
NENA Peripheral sodium channel 1 SCN9A_HUMAN Voltage-gated sodium channel subunit Nav1.7 hNE-Na
Type:
Protein
Mol. Mass.:
226375.97
Organism:
Homo sapiens (Human)
Description:
Q15858
Residue:
1988
  
Inhibitor
Name:
BDBM258176
Synonyms:
US9493448, 172 US9597330, Example 61 | US9845313, Example 172
Type:
Small organic molecule
Emp. Form.:
C20H22FN5O3S
Mol. Mass.:
431.484
SMILES:
Cc1cc(c(F)cc1O[C@H]1CCCC[C@@H]1c1cn[nH]c1)S(=O)(=O)Nc1ccncn1
: