Target
Lysine-specific demethylase 5B
Ligand
BDBM492449
Substrate
Meas. Tech.
TR-FRET (Time-Resolved Fluorescence Resonance Energy Transfer) Assay
IC50
5.08±n/a nM
Citation
 Mansoor, UFFischer, CSiliphaivanh, PTorres, LGunaydin, HSloman, DL KDM5 inhibitors US Patent  US10975084 Publication Date 4/13/2021 
Target
Name:
Lysine-specific demethylase 5B
Synonyms:
CT31 Histone demethylase JARID1B Jumonji/ARID domain-containing protein 1B KDM5B_HUMAN Lysine-specific demethylase 5B (KDM5Flag-5B-FL) PLU1 RBP2-H1 | Retinoblastoma-binding protein 2 homolog 1
Type:
Protein
Mol. Mass.:
175659.67
Organism:
Homo sapiens (Human)
Description:
Q9UGL1
Residue:
1544
  
Inhibitor
Name:
BDBM492449
Synonyms:
6-(1-methylethyl)-5-[1- (2-methylpropyl)-1H- pyrazol-4- yl][1,2,4]triazolo[1,5- a]pyrimidin-7(4H)-one | US10975084, Example 11-12
Type:
Small organic molecule
Emp. Form.:
C15H20N6O
Mol. Mass.:
300.3589
SMILES:
CC(C)Cn1cc(cn1)-c1[nH]c2ncnn2c(=O)c1C(C)C
: