Target
Lysine-specific demethylase 5B
Ligand
BDBM492450
Substrate
Meas. Tech.
TR-FRET (Time-Resolved Fluorescence Resonance Energy Transfer) Assay
IC50
5.08±n/a nM
Citation
 Mansoor, UFFischer, CSiliphaivanh, PTorres, LGunaydin, HSloman, DL KDM5 inhibitors US Patent  US10975084 Publication Date 4/13/2021 
Target
Name:
Lysine-specific demethylase 5B
Synonyms:
CT31 Histone demethylase JARID1B Jumonji/ARID domain-containing protein 1B KDM5B_HUMAN Lysine-specific demethylase 5B (KDM5Flag-5B-FL) PLU1 RBP2-H1 | Retinoblastoma-binding protein 2 homolog 1
Type:
Protein
Mol. Mass.:
175659.67
Organism:
Homo sapiens (Human)
Description:
Q9UGL1
Residue:
1544
  
Inhibitor
Name:
BDBM492450
Synonyms:
5-{1-[(1- fluorocyclopentyl)methyl]- 1H-pyrazol-4-yl}-6-(1- methylethyl)[1,2,4]triazolo[1,5- a]pyrimidin-7(4H)-one | US10975084, Example 11-13
Type:
Small organic molecule
Emp. Form.:
C17H21FN6O
Mol. Mass.:
344.3866
SMILES:
CC(C)c1c([nH]c2ncnn2c1=O)-c1cnn(CC2(F)CCCC2)c1
: