Target
AP2-associated protein kinase 1
Ligand
BDBM311155
Substrate
Meas. Tech.
AAK1 Kinase Assay
IC50
0.300±n/a nM
Citation
 Luo, GDzierba, CDMacor, JE Biaryl kinase inhibitors US Patent  US10981910 Publication Date 4/20/2021 
Target
Name:
AP2-associated protein kinase 1
Synonyms:
AAK1 Adaptor-associated kinase 1 | KIAA1048
Type:
PROTEIN
Mol. Mass.:
103884.23
Organism:
Homo sapiens (Human)
Description:
ChEMBL_774569
Residue:
961
  
Inhibitor
Name:
BDBM311155
Synonyms:
(S)-N-(4-(4-((2-amino-4-methylpentyl)oxy)-3-cyanophenyl)pyridin-2-yl)acetamide US10351563, Example 3 US10723734, Example 3 US9902722, Example 3
Type:
Small organic molecule
Emp. Form.:
C20H24N4O2
Mol. Mass.:
352.4302
SMILES:
CC(C)C[C@H](N)COc1ccc(cc1C#N)-c1ccnc(NC(C)=O)c1
: