Target
Ketohexokinase
Ligand
BDBM319587
Substrate
Meas. Tech.
Biological Assay
IC50
170±n/a nM
Citation
 Dowling, MFernando, DFutatsugi, KHuard, KMagee, TVRaymer, BShavnya, ASmith, AThuma, BTsai, ATu, M Substituted 3-azabicyclo[3.1.0]hexanes as ketohexokinase inhibitors US Patent  US10988463 Publication Date 4/27/2021 
Target
Name:
Ketohexokinase
Synonyms:
Hepatic fructokinase KHK_HUMAN Ketohexokinase (KHK) | Ketohexokinase (KHK) Isoform C
Type:
Enzyme Catalytic Domain
Mol. Mass.:
32521.64
Organism:
Homo sapiens (Human)
Description:
Residue:
298
  
Inhibitor
Name:
BDBM319587
Synonyms:
US10174007, Example 6 US11634410, Example 6
Type:
Small organic molecule
Emp. Form.:
C16H18F3N3O2
Mol. Mass.:
341.3282
SMILES:
OC(=O)C[C@H]1[C@@H]2CN(C[C@H]12)c1cc(nc(n1)C1CCC1)C(F)(F)F
: