Target
Cyclin-dependent kinase 9
Ligand
BDBM498187
Substrate
Meas. Tech.
Biochemical Assay
Ki
6.30±0 nM
Citation
 Behenna, DCFreeman-Cook, KDHoffman, RLNagata, ANinkovic, SSutton, SC CDK2 inhibitors US Patent  US11014911 Publication Date 5/25/2021 
Target
Name:
Cyclin-dependent kinase 9
Synonyms:
C-2K CDK9 Cell division cycle 2-like protein kinase 4 Cyclin-Dependent Kinase 9 (CDK9) Serine/threonine-protein kinase PITALRE Tat-associated kinase complex catalytic subunit
Type:
Enzyme Subunit
Mol. Mass.:
42789.13
Organism:
Homo sapiens (Human)
Description:
Residue:
372
  
Inhibitor
Name:
BDBM498187
Synonyms:
US11014911, Example 15 | US11718603, Example 15
Type:
Small organic molecule
Emp. Form.:
C19H25N5O4
Mol. Mass.:
387.4329
SMILES:
Cc1cc(CC(=O)Nc2cc([nH]n2)[C@H]2CC[C@H](C2)OC(=O)NC2(C)CC2)on1
: