Target
D(2) dopamine receptor
Ligand
BDBM301950
Substrate
Meas. Tech.
Binding Affinity Human Dopamine D2S Receptor Test
Ki
110±n/a nM
Citation
 Zhang, YJin, CZhou, R Substituted heteroaryl compounds and methods of use thereof US Patent  US9598401 Publication Date 3/21/2017 
Target
Name:
D(2) dopamine receptor
Synonyms:
D2(Short) | Dopamine D2 S receptor
Type:
Mol. Mass.:
47370.77
Organism:
Homo sapiens (Human)
Description:
P14416-2
Residue:
414
  
Inhibitor
Name:
BDBM301950
Synonyms:
3-(4-(4-(4,6-Dimethoxypyrimidin-2-yl)piperazin-1-yl)butyl)-5-fluoro-1H-indole | US9598401, Example 4
Type:
Small organic molecule
Emp. Form.:
C22H28FN5O2
Mol. Mass.:
413.4884
SMILES:
COc1cc(OC)nc(n1)N1CCN(CCCCc2c[nH]c3ccc(F)cc23)CC1
: