Target
D(2) dopamine receptor
Ligand
BDBM301974
Substrate
Meas. Tech.
Binding Affinity Human Dopamine D2S Receptor Test
Ki
310±n/a nM
Citation
 Zhang, YJin, CZhou, R Substituted heteroaryl compounds and methods of use thereof US Patent  US9598401 Publication Date 3/21/2017 
Target
Name:
D(2) dopamine receptor
Synonyms:
D2(Short) | Dopamine D2 S receptor
Type:
Mol. Mass.:
47370.77
Organism:
Homo sapiens (Human)
Description:
P14416-2
Residue:
414
  
Inhibitor
Name:
BDBM301974
Synonyms:
2-(4-(4-(5-Cyano-1H-indol-3-yl)butyl)piperazin-1-yl)pyrimidine-4-carboxamide | US9598401, Example 28
Type:
Small organic molecule
Emp. Form.:
C22H25N7O
Mol. Mass.:
403.4802
SMILES:
NC(=O)c1ccnc(n1)N1CCN(CCCCc2c[nH]c3ccc(cc23)C#N)CC1
: