Target
Cytochrome P450 11B1, mitochondrial
Ligand
BDBM287634
Substrate
Meas. Tech.
Enzyme Assay
IC50
5500±n/a nM
Citation
 Sparks, SYates, CMShaver, SRHoekstra, WJ Metalloenzyme inhibitor compounds US Patent  US11040034 Publication Date 6/22/2021 
Target
Name:
Cytochrome P450 11B1, mitochondrial
Synonyms:
C11B1_HUMAN CYPXIB1 Cytochrome P450 11B1 Cytochrome P450 11B1, mitochondrial | S11BH
Type:
Enzyme
Mol. Mass.:
57591.44
Organism:
Homo sapiens (Human)
Description:
P15538
Residue:
503
  
Inhibitor
Name:
BDBM287634
Synonyms:
US10085984, Example 12 | US11040034, Ex. No. 12
Type:
Small organic molecule
Emp. Form.:
C17H17FN4O
Mol. Mass.:
312.3415
SMILES:
CC(C)(O)c1cc(cnn1)-c1nc2ccc(F)cc2n1C1CC1
: