Target
Cytochrome P450 11B1, mitochondrial
Ligand
BDBM287710
Substrate
Meas. Tech.
Enzyme Assay
IC50
550±n/a nM
Citation
 Sparks, SYates, CMShaver, SRHoekstra, WJ Metalloenzyme inhibitor compounds US Patent  US11040034 Publication Date 6/22/2021 
Target
Name:
Cytochrome P450 11B1, mitochondrial
Synonyms:
C11B1_HUMAN CYPXIB1 Cytochrome P450 11B1 Cytochrome P450 11B1, mitochondrial | S11BH
Type:
Enzyme
Mol. Mass.:
57591.44
Organism:
Homo sapiens (Human)
Description:
P15538
Residue:
503
  
Inhibitor
Name:
BDBM287710
Synonyms:
US10085984, Example 88 | US11040034, Ex. No. 88
Type:
Small organic molecule
Emp. Form.:
C18H17F2N5O2S
Mol. Mass.:
405.422
SMILES:
Fc1cc2nc(-c3cnnc(CN4CCCS4(=O)=O)c3)n(C3CC3)c2cc1F
: