BDBM100008 2-amino-3,5-dichloro-benzoic acid [2-keto-2-[(2-keto-2-methoxy-ethyl)amino]ethyl] ester::2-amino-3,5-dichlorobenzoic acid [2-[(2-methoxy-2-oxoethyl)amino]-2-oxoethyl] ester::MLS000058024::SMR000063092::[2-[(2-methoxy-2-oxidanylidene-ethyl)amino]-2-oxidanylidene-ethyl] 2-azanyl-3,5-bis(chloranyl)benzoate::[2-[(2-methoxy-2-oxoethyl)amino]-2-oxoethyl] 2-amino-3,5-dichlorobenzoate::cid_2106737
SMILES COC(=O)CNC(=O)COC(=O)c1cc(Cl)cc(Cl)c1N
InChI Key InChIKey=NJLKETVAVDGRNE-UHFFFAOYSA-N
Data  1 EC50
  Tab Delimited (TSV)   2D SDfile   Computed 3D by Vconf -m prep SDfile
Find this compound or compounds like it in BindingDB:
Activity Spreadsheet -- Enzyme Inhibition Constant Data from BindingDB
Found 1 hit for monomerid = 100008
TargetKallikrein-7(Homo sapiens (Human))
The Scripps Research Institute Molecular Screening Center
Curated by PubChem BioAssay
LigandPNGBDBM100008(2-amino-3,5-dichloro-benzoic acid [2-keto-2-[(2-ke...)
Affinity DataEC50: >6.95E+4nM
In DepthDetails PCBioAssay