BDBM100089 MLS000850373::N-(4-{[(2,4-difluoroanilino)carbonyl]amino}phenyl)-2-hydroxybenzamide::N-[4-[(2,4-difluorophenyl)carbamoylamino]phenyl]-2-hydroxy-benzamide::N-[4-[(2,4-difluorophenyl)carbamoylamino]phenyl]-2-hydroxybenzamide::N-[4-[[(2,4-difluoroanilino)-oxomethyl]amino]phenyl]-2-hydroxybenzamide::N-[4-[[2,4-bis(fluoranyl)phenyl]carbamoylamino]phenyl]-2-oxidanyl-benzamide::SMR000456391::cid_2814075
SMILES Oc1ccccc1C(=O)Nc1ccc(NC(=O)Nc2ccc(F)cc2F)cc1
InChI Key InChIKey=LSUINVKFSDSWBJ-UHFFFAOYSA-N
Data  1 EC50
  Tab Delimited (TSV)   2D SDfile   Computed 3D by Vconf -m prep SDfile
Find this compound or compounds like it in BindingDB:
Activity Spreadsheet -- Enzyme Inhibition Constant Data from BindingDB
Found 1 hit for monomerid = 100089
TargetKallikrein-7(Homo sapiens (Human))
The Scripps Research Institute Molecular Screening Center
Curated by PubChem BioAssay
LigandPNGBDBM100089(MLS000850373 | N-(4-{[(2,4-difluoroanilino)carbony...)
Affinity DataEC50:  9.78E+3nM
In DepthDetails PCBioAssay