BDBM100210 2,3-bis(4-methylphenyl)quinolizin-5-ium;bromide::2,3-bis(4-methylphenyl)quinolizinium::2,3-bis(p-tolyl)quinolizin-5-ium;bromide::MLS000705941::SMR000230192::cid_13481921
SMILES Cc1ccc(cc1)-c1cc2cccc[n+]2cc1-c1ccc(C)cc1
InChI Key InChIKey=ANRIDOBNRMAQSL-UHFFFAOYSA-N
Data  2 IC50
  Tab Delimited (TSV)   2D SDfile   Computed 3D by Vconf -m prep SDfile
Find this compound or compounds like it in BindingDB:
Activity Spreadsheet -- Enzyme Inhibition Constant Data from BindingDB
Found 2 hits for monomerid = 100210
TargetTegument protein VP16(Human herpesvirus 1 (strain 17) (HHV-1) (Human her...)
The Scripps Research Institute Molecular Screening Center
Curated by PubChem BioAssay
LigandPNGBDBM100210(2,3-bis(4-methylphenyl)quinolizin-5-ium;bromide | ...)
Affinity DataIC50:  2.85E+4nM. Assay description: Source (MLPCN Center Name): The Scripps Research Institute Molecular Screening Center Affiliation: The Scripps Research Institute, TSRI Assay Provide...
Ligand InfoPC cidPC sid
In DepthDetails PCBioAssay
TargetCOUP transcription factor 2(Homo sapiens (Human))
The Scripps Research Institute Molecular Screening Center
Curated by PubChem BioAssay
LigandPNGBDBM100210(2,3-bis(4-methylphenyl)quinolizin-5-ium;bromide | ...)
Affinity DataIC50:  5.10E+3nM
Ligand InfoPC cidPC sid
In DepthDetails PCBioAssay