BDBM100226 1-(5,5-dimethyl-3-pyrrolidin-1-yl-cyclohex-2-en-1-ylidene)piperidin-1-ium;iodide::1-(5,5-dimethyl-3-pyrrolidin-1-ylcyclohex-2-en-1-ylidene)piperidin-1-ium;iodide::1-(5,5-dimethyl-3-pyrrolidino-cyclohex-2-en-1-ylidene)piperidin-1-ium;iodide::1-[5,5-dimethyl-3-(1-pyrrolidinyl)-1-cyclohex-2-enylidene]piperidin-1-ium;iodide::MLS001011184::SMR000353133::cid_15055242
SMILES [#6]C1([#6])[#6]-[#6](=[#6]\[#6](-[#6]1)=[#7+]-1/[#6]-[#6]-[#6]-[#6]-[#6]-1)-[#7]-1-[#6]-[#6]-[#6]-[#6]-1
InChI Key InChIKey=BQGWZUJISIWKHU-UHFFFAOYSA-N
Data  2 IC50
  Tab Delimited (TSV)   2D SDfile   Computed 3D by Vconf -m prep SDfile
Find this compound or compounds like it in BindingDB:
Activity Spreadsheet -- Enzyme Inhibition Constant Data from BindingDB
Found 2 hits for monomerid = 100226
TargetTegument protein VP16(Human herpesvirus 1 (strain 17) (HHV-1) (Human her...)
The Scripps Research Institute Molecular Screening Center
Curated by PubChem BioAssay
LigandPNGBDBM100226(1-(5,5-dimethyl-3-pyrrolidin-1-yl-cyclohex-2-en-1-...)
Affinity DataIC50:  8.54E+4nM. Assay description: Source (MLPCN Center Name): The Scripps Research Institute Molecular Screening Center Affiliation: The Scripps Research Institute, TSRI Assay Provide...
In DepthDetails PCBioAssay
TargetCOUP transcription factor 2(Homo sapiens (Human))
The Scripps Research Institute Molecular Screening Center
Curated by PubChem BioAssay
LigandPNGBDBM100226(1-(5,5-dimethyl-3-pyrrolidin-1-yl-cyclohex-2-en-1-...)
Affinity DataIC50:  1.69E+4nM
In DepthDetails PCBioAssay