BDBM100283 (3R,4S,5R)-4,5-dihydroxy-3-phosphonooxycyclohexene-1-carboxylic acid::Shikimate-3-phosphate
SMILES O[C@@H]1CC(=C[C@@H](OP(O)(O)=O)[C@H]1O)C(O)=O
InChI Key InChIKey=QYOJSKGCWNAKGW-PBXRRBTRSA-N
Data  1 Kd
PDB links: 22 PDB IDs match this monomer.
  Tab Delimited (TSV)   2D SDfile   Computed 3D by Vconf -m prep SDfile
Find this compound or compounds like it in BindingDB:
Activity Spreadsheet -- Enzyme Inhibition Constant Data from BindingDB
Found 1 hit for monomerid = 100283
Target3-phosphoshikimate 1-carboxyvinyltransferase(Escherichia coli (strain K12))
Monsanto Agricultural
LigandPNGBDBM100283((3R,4S,5R)-4,5-dihydroxy-3-phosphonooxycyclohexene...)
Affinity DataKd:  7.00E+3nMpH: 7.0 T: 2°C