BDBM102133 CHEMBL2435408::US8530648, 30
SMILES O=C1N(Cc2cccc3[nH]ccc23)CCCC11CCN(CC1)c1cnc2ccccc2n1
InChI Key InChIKey=DCKAOKXRHCMSPN-UHFFFAOYSA-N
Data  4 KI  2 Kd
  Tab Delimited (TSV)   2D SDfile   Computed 3D by Vconf -m prep SDfile
Find this compound or compounds like it in BindingDB:
Activity Spreadsheet -- Enzyme Inhibition Constant Data from BindingDB
Found 6 hits for monomerid = 102133
TargetOrexin receptor type 2(Homo sapiens (Human))
Novartis
US Patent
LigandPNGBDBM102133(CHEMBL2435408 | US8530648, 30)
Affinity DataKi:  63nMpH: 7.4Assay Description:FLIPR assay using orexin receptor.
In DepthDetails US Patent
TargetOrexin receptor type 2(Homo sapiens (Human))
Novartis
US Patent
LigandPNGBDBM102133(CHEMBL2435408 | US8530648, 30)
Affinity DataKi:  78nM. Assay description: Antagonist activity at human OX2 receptor expressed in HEK cells assessed as inhibition of orexin A-induced Ca2+ accumulation after 1 hr by Fluo-4-AM...
In DepthDetails ArticlePubMed
TargetOrexin/Hypocretin receptor type 1(Homo sapiens (Human))
Novartis
US Patent
LigandPNGBDBM102133(CHEMBL2435408 | US8530648, 30)
Affinity DataKi:  474nMpH: 7.4Assay Description:FLIPR assay using orexin receptor.
In DepthDetails US Patent
TargetOrexin/Hypocretin receptor type 1(Homo sapiens (Human))
Novartis
US Patent
LigandPNGBDBM102133(CHEMBL2435408 | US8530648, 30)
Affinity DataKi:  550nM. Assay description: Antagonist activity at human OX1 receptor expressed in CHO cells assessed as inhibition of orexin A-induced Ca2+ accumulation after 1 hr by Fluo-4-AM...
In DepthDetails ArticlePubMed
TargetOrexin/Hypocretin receptor type 1(Homo sapiens (Human))
Novartis
US Patent
LigandPNGBDBM102133(CHEMBL2435408 | US8530648, 30)
Affinity DataKd:  630nMpH: 7.5Assay Description:Radioligand binding assay using orexin receptor.
In DepthDetails US Patent
TargetOrexin receptor type 2(Homo sapiens (Human))
Novartis
US Patent
LigandPNGBDBM102133(CHEMBL2435408 | US8530648, 30)
Affinity DataKd:  130nMpH: 7.5Assay Description:Radioligand binding assay using orexin receptor.
In DepthDetails US Patent