BDBM102138 US8530648, 8
SMILES O=C1N(Cc2ccc3OCOc3c2)CCCC11CCN(CC1)c1cnc2ccccc2n1
InChI Key InChIKey=ONVQIMRWQOAOKB-UHFFFAOYSA-N
Data  2 KI  2 Kd
  Tab Delimited (TSV)   2D SDfile   Computed 3D by Vconf -m prep SDfile
Find this compound or compounds like it in BindingDB:
Activity Spreadsheet -- Enzyme Inhibition Constant Data from BindingDB
Found 4 hits for monomerid = 102138
TargetOrexin receptor type 2(Homo sapiens (Human))
Novartis
US Patent
LigandPNGBDBM102138(US8530648, 8)
Affinity DataKi:  399nMpH: 7.4Assay Description:FLIPR assay using orexin receptor.
In DepthDetails US Patent
TargetOrexin/Hypocretin receptor type 1(Homo sapiens (Human))
Novartis
US Patent
LigandPNGBDBM102138(US8530648, 8)
Affinity DataKi:  1.22E+3nMpH: 7.4Assay Description:FLIPR assay using orexin receptor.
In DepthDetails US Patent
TargetOrexin receptor type 2(Homo sapiens (Human))
Novartis
US Patent
LigandPNGBDBM102138(US8530648, 8)
Affinity DataKd:  585nMpH: 7.5Assay Description:Radioligand binding assay using orexin receptor.
In DepthDetails US Patent
TargetOrexin/Hypocretin receptor type 1(Homo sapiens (Human))
Novartis
US Patent
LigandPNGBDBM102138(US8530648, 8)
Affinity DataKd:  2.33E+3nMpH: 7.5Assay Description:Radioligand binding assay using orexin receptor.
In DepthDetails US Patent