BDBM102141 US8530648, 38
SMILES O=C1N(Cc2cccc3ccccc23)CCCC11CCN(CC1)c1nc2ccccc2[nH]1
InChI Key InChIKey=QVQBRELNCAXZCF-UHFFFAOYSA-N
Data  2 KI  2 Kd
  Tab Delimited (TSV)   2D SDfile   Computed 3D by Vconf -m prep SDfile
Find this compound or compounds like it in BindingDB:
Activity Spreadsheet -- Enzyme Inhibition Constant Data from BindingDB
Found 4 hits for monomerid = 102141
TargetOrexin receptor type 2(Homo sapiens (Human))
Novartis
US Patent
LigandPNGBDBM102141(US8530648, 38)
Affinity DataKi:  126nMpH: 7.4Assay Description:FLIPR assay using orexin receptor.
In DepthDetails US Patent
TargetOrexin/Hypocretin receptor type 1(Homo sapiens (Human))
Novartis
US Patent
LigandPNGBDBM102141(US8530648, 38)
Affinity DataKi:  2.46E+3nMpH: 7.4Assay Description:FLIPR assay using orexin receptor.
In DepthDetails US Patent
TargetOrexin receptor type 2(Homo sapiens (Human))
Novartis
US Patent
LigandPNGBDBM102141(US8530648, 38)
Affinity DataKd:  755nMpH: 7.5Assay Description:Radioligand binding assay using orexin receptor.
In DepthDetails US Patent
TargetOrexin/Hypocretin receptor type 1(Homo sapiens (Human))
Novartis
US Patent
LigandPNGBDBM102141(US8530648, 38)
Affinity DataKd: >1.00E+4nMpH: 7.5Assay Description:Radioligand binding assay using orexin receptor.
In DepthDetails US Patent