BDBM102153 US8530648, 50
SMILES FC(F)(F)c1ccccc1CN1CCCC2(CCN(CC2)c2cnc3ccccc3n2)C1=O
InChI Key InChIKey=LAZFQQSOMFUUKF-UHFFFAOYSA-N
Data  2 KI  2 Kd
  Tab Delimited (TSV)   2D SDfile   Computed 3D by Vconf -m prep SDfile
Find this compound or compounds like it in BindingDB:
Activity Spreadsheet -- Enzyme Inhibition Constant Data from BindingDB
Found 4 hits for monomerid = 102153
TargetOrexin receptor type 2(Homo sapiens (Human))
Novartis
US Patent
LigandPNGBDBM102153(US8530648, 50)
Affinity DataKi:  280nMpH: 7.4Assay Description:FLIPR assay using orexin receptor.
In DepthDetails US Patent
TargetOrexin/Hypocretin receptor type 1(Homo sapiens (Human))
Novartis
US Patent
LigandPNGBDBM102153(US8530648, 50)
Affinity DataKi:  2.74E+3nMpH: 7.4Assay Description:FLIPR assay using orexin receptor.
In DepthDetails US Patent
TargetOrexin receptor type 2(Homo sapiens (Human))
Novartis
US Patent
LigandPNGBDBM102153(US8530648, 50)
Affinity DataKd:  1.09E+3nMpH: 7.5Assay Description:Radioligand binding assay using orexin receptor.
In DepthDetails US Patent
TargetOrexin/Hypocretin receptor type 1(Homo sapiens (Human))
Novartis
US Patent
LigandPNGBDBM102153(US8530648, 50)
Affinity DataKd:  4.48E+3nMpH: 7.5Assay Description:Radioligand binding assay using orexin receptor.
In DepthDetails US Patent