BDBM102747 US8541572, 1918
SMILES COc1ccc2CN(C[C@]3(NC(=O)NC3=O)C#Cc3ccccc3C=O)C(=O)c2c1
InChI Key InChIKey=CEYGEGGSWNVPPZ-JOCHJYFZSA-N
Data  1 KI  1 IC50
  Tab Delimited (TSV)   2D SDfile   Computed 3D by Vconf -m prep SDfile
Find this compound or compounds like it in BindingDB:
Activity Spreadsheet -- Enzyme Inhibition Constant Data from BindingDB
Found 1 hit for monomerid = 102747
TargetTumor necrosis factor(Homo sapiens (Human))
Merck Sharp & Dohme
US Patent
LigandPNGBDBM102747(US8541572, 1918)
Affinity DataKi:  0.110nM IC50:  936nM. Assay description: Inhibition assay using TNF-alpha.
In DepthDetails US Patent