BDBM102852 US8541572, 936
SMILES CCN1CCN(CC1)c1ccc(O)c(n1)-c1ccc(cc1)C#C[C@]1(CN2Cc3ccc(OC)cc3C2=O)NC(=O)NC1=O
InChI Key InChIKey=CQYNQICIXCKTTL-JGCGQSQUSA-N
Data  1 KI  1 IC50
  Tab Delimited (TSV)   2D SDfile   Computed 3D by Vconf -m prep SDfile
Find this compound or compounds like it in BindingDB:
Activity Spreadsheet -- Enzyme Inhibition Constant Data from BindingDB
Found 1 hit for monomerid = 102852
TargetTumor necrosis factor(Homo sapiens (Human))
Merck Sharp & Dohme
US Patent
LigandPNGBDBM102852(US8541572, 936)
Affinity DataKi:  0.0930nM IC50:  72.4nM. Assay description: Inhibition assay using TNF-alpha.
In DepthDetails US Patent