BDBM10345 (S)-1-(6-Fluoropyridin-3-ylmethyl)-5-(2-phenoxymethyl-azetidine1-sulfonyl)-1H-indole-2,3-dione::1-[(6-fluoropyridin-3-yl)methyl]-5-{[(2S)-2-(phenoxymethyl)azetidine-1-]sulfonyl}-2,3-dihydro-1H-indole-2,3-dione::Azetidine Isatin Analogue 18g
SMILES Fc1ccc(CN2C(=O)C(=O)c3cc(ccc23)S(=O)(=O)N2CC[C@H]2COc2ccccc2)cn1
InChI Key InChIKey=UITSDZFHHJSHNP-KRWDZBQOSA-N
Data  6 IC50
  Tab Delimited (TSV)   2D SDfile   Computed 3D by Vconf -m prep SDfile
Find this compound or compounds like it in BindingDB:
Activity Spreadsheet -- Enzyme Inhibition Constant Data from BindingDB
Found 6 hits for monomerid = 10345
TargetCaspase-3(Homo sapiens (Human))
Washington University
LigandPNGBDBM10345((S)-1-(6-Fluoropyridin-3-ylmethyl)-5-(2-phenoxymet...)
Affinity DataIC50:  10.9nM. Assay description: The substrate peptides terminating in AMC are processed by caspases with or without inhibitors. The amount of AMC released was determined by using a ...
In DepthDetails ArticlePubMed
TargetCaspase-7(Homo sapiens (Human))
Washington University
LigandPNGBDBM10345((S)-1-(6-Fluoropyridin-3-ylmethyl)-5-(2-phenoxymet...)
Affinity DataIC50:  17nM. Assay description: The substrate peptides terminating in AMC are processed by caspases with or without inhibitors. The amount of AMC released was determined by using a ...
In DepthDetails ArticlePubMed
TargetCaspase-3(Homo sapiens (Human))
Washington University
LigandPNGBDBM10345((S)-1-(6-Fluoropyridin-3-ylmethyl)-5-(2-phenoxymet...)
Affinity DataIC50:  11.0nM. Assay description: Inhibition of caspase3
In DepthDetails ArticlePubMed
TargetCaspase-6(Homo sapiens (Human))
Washington University
LigandPNGBDBM10345((S)-1-(6-Fluoropyridin-3-ylmethyl)-5-(2-phenoxymet...)
Affinity DataIC50: >5.00E+3nM. Assay description: The substrate peptides terminating in AMC are processed by caspases with or without inhibitors. The amount of AMC released was determined by using a ...
In DepthDetails ArticlePubMed
TargetCaspase-8(Homo sapiens (Human))
Washington University
LigandPNGBDBM10345((S)-1-(6-Fluoropyridin-3-ylmethyl)-5-(2-phenoxymet...)
Affinity DataIC50: >5.00E+4nM. Assay description: The substrate peptides terminating in AMC are processed by caspases with or without inhibitors. The amount of AMC released was determined by using a ...
In DepthDetails ArticlePubMed
TargetCaspase-1(Homo sapiens (Human))
Washington University
LigandPNGBDBM10345((S)-1-(6-Fluoropyridin-3-ylmethyl)-5-(2-phenoxymet...)
Affinity DataIC50: >5.00E+4nM. Assay description: The substrate peptides terminating in AMC are processed by caspases with or without inhibitors. The amount of AMC released was determined by using a ...
In DepthDetails ArticlePubMed