BDBM103554 STO1131::US8551988, 39
SMILES CC(NC(=O)CCc1nc2ccccc2c(=O)[nH]1)c1ccccn1
InChI Key InChIKey=HWTVYWVFOWWESR-UHFFFAOYSA-N
Data  1 IC50
PDB links: 1 PDB ID matches this monomer.
  Tab Delimited (TSV)   2D SDfile   Computed 3D by Vconf -m prep SDfile
Find this compound or compounds like it in BindingDB:
Activity Spreadsheet -- Enzyme Inhibition Constant Data from BindingDB
Found 1 hit for monomerid = 103554
TargetProtein mono-ADP-ribosyltransferase PARP3 [R100H](Homo sapiens (Human))
Ume£
LigandPNGBDBM103554(STO1131 | US8551988, 39)
Affinity DataIC50:  6.00E+3nM. Assay description: Experiments todetermine IC50 values were conducted with compound concentrationsin the range between 10 nM and 450 μM with a DMSO concentrationof...