BDBM106992 US8592579, 57
SMILES O=C([C@@H]1CCCN1c1nc(Nc2cc([nH]n2)C2CC2)c2cccn2n1)N1CCNCC1
InChI Key InChIKey=ZYYPRWXJKRVAER-KRWDZBQOSA-N
Data  1 IC50
  Tab Delimited (TSV)   2D SDfile   Computed 3D by Vconf -m prep SDfile
Find this compound or compounds like it in BindingDB:
Activity Spreadsheet -- Enzyme Inhibition Constant Data from BindingDB
Found 1 hit for monomerid = 106992
TargetInsulin-like growth factor 1 receptor(Homo sapiens (Human))
Bristol-Myers Squibb
US Patent
LigandPNGBDBM106992(US8592579, 57)
Affinity DataIC50:  1.52E+3nMpH: 7.4Assay Description:Kinase assay using IGF1-receptor.
In DepthDetails US Patent