BDBM107000 US8592579, 104
SMILES C[C@]1(CCCN1c1nc(Nc2cc(n[nH]2)C2CC2)c2cccn2n1)C(=O)Nc1ccc(F)nc1
InChI Key InChIKey=LQVXSNNAFNGRAH-QHCPKHFHSA-N
Data  1 IC50
PDB links: 1 PDB ID matches this monomer.
  Tab Delimited (TSV)   2D SDfile   Computed 3D by Vconf -m prep SDfile
Find this compound or compounds like it in BindingDB:
Activity Spreadsheet -- Enzyme Inhibition Constant Data from BindingDB
Found 1 hit for monomerid = 107000
TargetInsulin-like growth factor 1 receptor(Homo sapiens (Human))
Bristol-Myers Squibb
US Patent
LigandPNGBDBM107000(US8592579, 104)
Affinity DataIC50:  2nMpH: 7.4Assay Description:Kinase assay using IGF1-receptor.