BDBM111787 US8618114, 1.2.22(2).HCl
SMILES CNc1nn2c(C)c(CN)c(C)nc2c1S(=O)(=O)c1ccccc1
InChI Key InChIKey=MDPSXQAHCIOACT-UHFFFAOYSA-N
Data  2 IC50
  Tab Delimited (TSV)   2D SDfile   Computed 3D by Vconf -m prep SDfile
Find this compound or compounds like it in BindingDB:
Activity Spreadsheet -- Enzyme Inhibition Constant Data from BindingDB
Found 2 hits for monomerid = 111787
Target5-hydroxytryptamine receptor 6(Homo sapiens (Human))
TBA
US Patent
LigandPNGBDBM111787(US8618114, 1.2.22(2).HCl)
Affinity DataIC50:  0.560nM. Assay description: Screening of the disclosed compounds for their potential ability to interact with serotonin 5-HT6 receptors was carried out by method of radioligand ...
In DepthDetails US Patent
Target5-hydroxytryptamine receptor 6(Homo sapiens (Human))
TBA
US Patent
LigandPNGBDBM111787(US8618114, 1.2.22(2).HCl)
Affinity DataIC50:  9nM. Assay description: Determination of antagonistic activity of compounds of the general formula 1 towards 5-HT6 receptors. Compounds of the general formula 1 were tested ...
In DepthDetails US Patent