BDBM11278 N-(5-chloro-2-phenoxyphenyl)-2-[(4-methyl-6-oxo-1,6-dihydropyrimidin-2-yl)sulfanyl]acetamide::acs.jmedchem.1c00409_ST.753::pyrimidinone-containing compound 15
SMILES Cc1cc(=O)[nH]c(SCC(=O)Nc2cc(Cl)ccc2Oc2ccccc2)n1
InChI Key InChIKey=KROPIDGCKMSLKK-UHFFFAOYSA-N
Data  2 IC50
  Tab Delimited (TSV)   2D SDfile   Computed 3D by Vconf -m prep SDfile
Find this compound or compounds like it in BindingDB:
Activity Spreadsheet -- Enzyme Inhibition Constant Data from BindingDB
Found 2 hits for monomerid = 11278
TargetReplicase polyprotein 1ab(Human SARS coronavirus (SARS-CoV) (Severe acute re...)
Michigan State University
LigandPNGBDBM11278(N-(5-chloro-2-phenoxyphenyl)-2-[(4-methyl-6-oxo-1,...)
Affinity DataIC50:  1.00E+5nM. Assay description: This is a review article. Please point to the original journal.
In DepthDetails ArticlePubMed
TargetReplicase polyprotein 1ab(Human SARS coronavirus (SARS-CoV) (Severe acute re...)
Michigan State University
LigandPNGBDBM11278(N-(5-chloro-2-phenoxyphenyl)-2-[(4-methyl-6-oxo-1,...)
Affinity DataIC50:  1.00E+5nM. Assay description: The effects of compound on enzyme activity were measured by using a fluorogenic peptide cleavage assay. Enhanced fluorescence caused by cleavage of t...
In DepthDetails ArticlePubMed