BDBM112803 US8629167, 13
SMILES C[C@H](O)[C@@H](Nc1ccc([N+]#[C-])c2ccccc12)c1nnc(o1)-c1ccccc1
InChI Key InChIKey=GCNMKVGMAKQJHP-VBKZILBWSA-N
Data  1 IC50
  Tab Delimited (TSV)   2D SDfile   Computed 3D by Vconf -m prep SDfile
Find this compound or compounds like it in BindingDB:
Activity Spreadsheet -- Enzyme Inhibition Constant Data from BindingDB
Found 1 hit for monomerid = 112803
TargetAndrogen receptor(Rattus norvegicus (Rat))
Radius Health
US Patent
LigandPNGBDBM112803(US8629167, 13)
Affinity DataIC50:  5nM. Assay description: In order to demonstrate the utility of the compounds of this invention, an androgen receptor binding assay was performed wherein many of the compound...
In DepthDetails US Patent